Reaction Details
TargetSerine/threonine-protein kinase mTOR
LigandBDBM50304675
Substrate/Competitorn/a
Meas. Tech.ChEMBL_605539 (CHEMBL1067293)
IC50 0.29±n/a nM
Citation Verheijen, JCYu, KToral-Barza, LHollander, IZask, A Discovery of 2-arylthieno[3,2-d]pyrimidines containing 8-oxa-3-azabi-cyclo[3.2.1]octane in the 4-position as potent inhibitors of mTOR with selectivity over PI3K. Bioorg Med Chem Lett20:375-9 (2010) 
 
Serine/threonine-protein kinase mTOR
Name:Serine/threonine-protein kinase mTOR
Type:Rapamycin target protein
Mol. Mass.:288917.12
Organism:Homo sapiens (Human)
Description:P42345
Residue:2549
BDBM50304675
NameBDBM50304675
Synonyms:1-(4-(4-(8-oxa-3-azabicyclo[3.2.1]octan-3-yl)thieno[3,2-d]pyrimidin-2-yl)phenyl)-3-(pyridin-3-yl)urea | CHEMBL595256
TypeSmall organic molecule
Emp. Form.C24H22N6O2S
Mol. Mass.458.535
SMILESO=C(Nc1ccc(cc1)-c1nc(N2CC3CCC(C2)O3)c2sccc2n1)Nc1cccnc1