Reaction Details
TargetPhosphatidylinositol 4,5-bisphosphate 3-kinase catalytic subunit alpha isoform
LigandBDBM25018
Substrate/Competitorn/a
Meas. Tech.ChEMBL_605540 (CHEMBL1067294)
IC50 41±n/a nM
Citation Verheijen, JCYu, KToral-Barza, LHollander, IZask, A Discovery of 2-arylthieno[3,2-d]pyrimidines containing 8-oxa-3-azabi-cyclo[3.2.1]octane in the 4-position as potent inhibitors of mTOR with selectivity over PI3K. Bioorg Med Chem Lett20:375-9 (2010) 
 
Phosphatidylinositol 4,5-bisphosphate 3-kinase catalytic subunit alpha isoform
Name:Phosphatidylinositol 4,5-bisphosphate 3-kinase catalytic subunit alpha isoform
Type:Enzyme Subunit
Mol. Mass.:124294.87
Organism:Homo sapiens (Human)
Description:P42336
Residue:1068
BDBM25018
NameBDBM25018
Synonyms:3-(4-morpholin-4-ylthieno[3,2-d]pyrimidin-2-yl)phenol CHEMBL541643 thienopyrimidine derivative, 1
TypeSmall organic molecule
Emp. Form.C16H15N3O2S
Mol. Mass.313.374
SMILESOc1cccc(c1)-c1nc(N2CCOCC2)c2sccc2n1