Reaction Details
TargetGlutamate carboxypeptidase 2
LigandBDBM50304711
Substrate/Competitorn/a
Meas. Tech.ChEMBL_605564 (CHEMBL1067318)
Ki 775±n/a nM
Citation Wang, HByun, YBarinka, CPullambhatla, MBhang, HEFox, JJLubkowski, JMease, RCPomper, MG Bioisosterism of urea-based GCPII inhibitors: Synthesis and structure-activity relationship studies. Bioorg Med Chem Lett20:392-7 (2010) 
 
Glutamate carboxypeptidase 2
Name:Glutamate carboxypeptidase 2
Type:PROTEIN
Mol. Mass.:84333.66
Organism:Homo sapiens (Human)
Description:ChEMBL_1497035
Residue:750
BDBM50304711
NameBDBM50304711
Synonyms:(S)-2-(3-((S)-carboxy(4-hydroxyphenyl)methyl)ureido)-4-methylpentanoic acid | CHEMBL594043
TypeSmall organic molecule
Emp. Form.C15H20N2O6
Mol. Mass.324.3291
SMILESCC(C)C[C@H](NC(=O)NC(C(O)=O)c1ccc(O)cc1)C(O)=O