Reaction Details
TargetGlutamate carboxypeptidase 2
LigandBDBM50304735
Substrate/Competitorn/a
Meas. Tech.ChEMBL_605563 (CHEMBL1067317)
Ki 16.1±n/a nM
Citation Wang, HByun, YBarinka, CPullambhatla, MBhang, HEFox, JJLubkowski, JMease, RCPomper, MG Bioisosterism of urea-based GCPII inhibitors: Synthesis and structure-activity relationship studies. Bioorg Med Chem Lett20:392-7 (2010) 
 
Glutamate carboxypeptidase 2
Name:Glutamate carboxypeptidase 2
Type:PROTEIN
Mol. Mass.:84333.66
Organism:Homo sapiens (Human)
Description:ChEMBL_1497035
Residue:750
BDBM50304735
NameBDBM50304735
Synonyms:(S)-2-(3-((S)-1-Carboxy-2-(thiazol-4-yl)ethyl)ureido)-6-(4-iodobenzamido)hexanoic acid | CHEMBL593324
TypeSmall organic molecule
Emp. Form.C20H23IN4O6S
Mol. Mass.574.389
SMILESOC(=O)[C@H](CCCCNC(=O)c1ccc(I)cc1)NC(=O)N[C@@H](Cc1cscn1)C(O)=O