Reaction Details
TargetGlutamate carboxypeptidase 2
LigandBDBM50304739
Substrate/Competitorn/a
Meas. Tech.ChEMBL_605564 (CHEMBL1067318)
Ki 700±n/a nM
Citation Wang, HByun, YBarinka, CPullambhatla, MBhang, HEFox, JJLubkowski, JMease, RCPomper, MG Bioisosterism of urea-based GCPII inhibitors: Synthesis and structure-activity relationship studies. Bioorg Med Chem Lett20:392-7 (2010) 
 
Glutamate carboxypeptidase 2
Name:Glutamate carboxypeptidase 2
Type:PROTEIN
Mol. Mass.:84333.66
Organism:Homo sapiens (Human)
Description:ChEMBL_1497035
Residue:750
BDBM50304739
NameBDBM50304739
Synonyms:2-(3-(1-Carboxy-2-(4-hydroxyphenyl)ethyl)ureido)-4-methylpentanoic acid | CHEMBL611038
TypeSmall organic molecule
Emp. Form.C16H22N2O6
Mol. Mass.338.3557
SMILESCC(C)C[C@H](NC(=O)N[C@@H](Cc1ccc(O)cc1)C(O)=O)C(O)=O