Reaction Details
TargetGlutamate carboxypeptidase 2
LigandBDBM50304747
Substrate/Competitorn/a
Meas. Tech.ChEMBL_605564 (CHEMBL1067318)
Ki>1000000±n/a nM
Citation Wang, HByun, YBarinka, CPullambhatla, MBhang, HEFox, JJLubkowski, JMease, RCPomper, MG Bioisosterism of urea-based GCPII inhibitors: Synthesis and structure-activity relationship studies. Bioorg Med Chem Lett20:392-7 (2010) 
 
Glutamate carboxypeptidase 2
Name:Glutamate carboxypeptidase 2
Type:PROTEIN
Mol. Mass.:84333.66
Organism:Homo sapiens (Human)
Description:ChEMBL_1497035
Residue:750
BDBM50304747
NameBDBM50304747
Synonyms:(S)-2-(3-((S)-1-Carboxy-2-(1H-indol-3-yl)ethyl)ureido)-4-methylpentanoic acid | CHEMBL605939
TypeSmall organic molecule
Emp. Form.C20H27N3O5
Mol. Mass.389.4455
SMILESCOC(=O)[C@H](CC(C)C)NC(=O)N[C@@H](CCc1c[nH]c2ccccc12)C(O)=O