Reaction Details
TargetThyroid hormone receptor beta
LigandBDBM50304777
Substrate/Competitorn/a
Meas. Tech.ChEMBL_605571 (CHEMBL1068514)
Ki 0.5±n/a nM
Citation Li, JJMitchell, LHDow, RL Thyroid receptor agonists for the treatment of androgenetic alopecia. Bioorg Med Chem Lett20:306-8 (2010) 
 
Thyroid hormone receptor beta
Name:Thyroid hormone receptor beta
Type:Receptor
Mol. Mass.:52793.62
Organism:Homo sapiens (Human)
Description:Recombinant hThR was obtained from nuclear extracts from SF9 cells infected with baculovirus vectors encoding for ThRbeta 1.
Residue:461
BDBM50304777
NameBDBM50304777
Synonyms:2-(4-(7-hydroxy-2,3-dihydro-1H-inden-4-yloxy)-3,5-dimethylphenylamino)-2-oxoacetic acid | CHEMBL608990
TypeSmall organic molecule
Emp. Form.C19H19NO5
Mol. Mass.341.3579
SMILESCc1cc(NC(=O)C(O)=O)cc(C)c1Oc1ccc(O)c2CCCc12