Reaction Details
TargetThyroid hormone receptor beta
LigandBDBM50304778
Substrate/Competitorn/a
Meas. Tech.ChEMBL_605571 (CHEMBL1068514)
Ki 0.5±n/a nM
Citation Li, JJMitchell, LHDow, RL Thyroid receptor agonists for the treatment of androgenetic alopecia. Bioorg Med Chem Lett20:306-8 (2010) 
 
Thyroid hormone receptor beta
Name:Thyroid hormone receptor beta
Type:Receptor
Mol. Mass.:52793.62
Organism:Homo sapiens (Human)
Description:Recombinant hThR was obtained from nuclear extracts from SF9 cells infected with baculovirus vectors encoding for ThRbeta 1.
Residue:461
BDBM50304778
NameBDBM50304778
Synonyms:3-(3-chloro-4-(3-(cyclobutylmethylsulfonyl)-4-hydroxyphenoxy)-5-methylphenylamino)-3-oxopropanoic acid | CHEMBL594047
TypeSmall organic molecule
Emp. Form.C21H22ClNO7S
Mol. Mass.467.92
SMILESCc1cc(NC(=O)CC(O)=O)cc(Cl)c1Oc1ccc(O)c(c1)S(=O)(=O)CC1CCC1