Reaction Details
TargetThyroid hormone receptor beta
LigandBDBM50123049
Substrate/Competitorn/a
Meas. Tech.ChEMBL_605571 (CHEMBL1068514)
Ki 1±n/a nM
Citation Li, JJMitchell, LHDow, RL Thyroid receptor agonists for the treatment of androgenetic alopecia. Bioorg Med Chem Lett20:306-8 (2010) 
 
Thyroid hormone receptor beta
Name:Thyroid hormone receptor beta
Type:Receptor
Mol. Mass.:52793.62
Organism:Homo sapiens (Human)
Description:Recombinant hThR was obtained from nuclear extracts from SF9 cells infected with baculovirus vectors encoding for ThRbeta 1.
Residue:461
BDBM50123049
NameBDBM50123049
Synonyms:2-(3,5-dichloro-4-(4-hydroxy-3-(piperidine-1-carbonyl)phenoxy)phenyl)-1,2,4-triazine-3,5(2H,4H)-dione CHEMBL125242
TypeSmall organic molecule
Emp. Form.C21H18Cl2N4O5
Mol. Mass.477.297
SMILESOc1ccc(Oc2c(Cl)cc(cc2Cl)-n2ncc(=O)[nH]c2=O)cc1C(=O)N1CCCCC1