Reaction Details
TargetThyroid hormone receptor alpha
LigandBDBM50304781
Substrate/Competitorn/a
Meas. Tech.ChEMBL_605572 (CHEMBL1068515)
Ki 3±n/a nM
Citation Li, JJMitchell, LHDow, RL Thyroid receptor agonists for the treatment of androgenetic alopecia. Bioorg Med Chem Lett20:306-8 (2010) 
 
Thyroid hormone receptor alpha
Name:Thyroid hormone receptor alpha
Type:Receptor
Mol. Mass.:54818.00
Organism:Homo sapiens (Human)
Description:Recombinant hThR was obtained from nuclear extracts from SF9 cells infected with baculovirus vectors encoding for ThRalpha 1.
Residue:490
BDBM50304781
NameBDBM50304781
Synonyms:2-(4-(3-(4-fluorobenzyl)-4-hydroxyphenoxy)-3,5-dimethylphenyl)-1,2,4-triazine-3,5(2H,4H)-dione PF-00277343
TypeSmall organic molecule
Emp. Form.C24H20FN3O4
Mol. Mass.433.4317
SMILESCc1cc(cc(C)c1Oc1ccc(O)c(Cc2ccc(F)cc2)c1)-n1ncc(=O)[nH]c1=O