Reaction Details
TargetPapain
LigandBDBM50304793
Substrate/Competitorn/a
Meas. Tech.ChEMBL_606254 (CHEMBL1069944)
Ki 3.9±n/a nM
Citation Löser, RGut, JRosenthal, PJFrizler, MGütschow, MAndrews, KT Antimalarial activity of azadipeptide nitriles. Bioorg Med Chem Lett20:252-5 (2010) 
 
Papain
Name:Papain
Type:Enzyme
Mol. Mass.:38923.01
Organism:Carica papaya
Description:Papain was purchased from Sigma, Germany.
Residue:345
BDBM50304793
NameBDBM50304793
Synonyms:(S)-benzyl 1-(2-cyano-1,2-dimethylhydrazinyl)-1-oxo-3-phenylpropan-2-ylcarbamate acs.jmedchem.1c00409_ST.400
TypeSmall organic molecule
Emp. Form.C20H22N4O3
Mol. Mass.366.4137
SMILESCN(C#N)N(C)C(=O)[C@H](Cc1ccccc1)NC(=O)OCc1ccccc1