Reaction Details
TargetPapain
LigandBDBM50304799
Substrate/Competitorn/a
Meas. Tech.ChEMBL_606254 (CHEMBL1069944)
Ki 750000±n/a nM
Citation Löser, RGut, JRosenthal, PJFrizler, MGütschow, MAndrews, KT Antimalarial activity of azadipeptide nitriles. Bioorg Med Chem Lett20:252-5 (2010) 
 
Papain
Name:Papain
Type:Enzyme
Mol. Mass.:38923.01
Organism:Carica papaya
Description:Papain was purchased from Sigma, Germany.
Residue:345
BDBM50304799
NameBDBM50304799
Synonyms:CHEMBL603537 | benzyl(S)-1-(((S)-1-cyanoethyl)(methyl)amino)-1-oxo-3-phenylpropan-2-ylcarbamate
TypeSmall organic molecule
Emp. Form.C21H23N3O3
Mol. Mass.365.4256
SMILESC[C@@H](C#N)N(C)C(=O)[C@H](Cc1ccccc1)NC(=O)OCc1ccccc1