Reaction Details
Target5-hydroxytryptamine receptor 2B
LigandBDBM50304807
Substrate/Competitorn/a
Meas. Tech.ChEMBL_606269 (CHEMBL1069959)
EC50>10000±n/a nM
Citation Liu, KKCornelius, PPatterson, TAZeng, YSantucci, STomlinson, EGibbons, CMaurer, TSMarala, RBrown, JKong, JXLee, EWerner, WWenzel, ZVage, C Design and synthesis of orally-active and selective azaindane 5HT2c agonist for the treatment of obesity. Bioorg Med Chem Lett20:266-71 (2010) 
 
5-hydroxytryptamine receptor 2B
Name:5-hydroxytryptamine receptor 2B
Type:G Protein-Coupled Receptor (GPCR)
Mol. Mass.:54312.47
Organism:Homo sapiens (Human)
Description:Receptor binding assays were performed using human clone stably expressed in CHO cells.
Residue:481
BDBM50304807
NameBDBM50304807
Synonyms:(S)-7-(5-fluoro-2-methylbenzyloxy)-2-((R)-2-methylpiperazin-1-yl)-6,7-dihydro-5H-cyclopenta[b]pyridine | CHEMBL594717
TypeSmall organic molecule
Emp. Form.C21H26FN3O
Mol. Mass.355.449
SMILESC[C@@H]1CNCCN1c1ccc2CC[C@H](OCc3cc(F)ccc3C)c2n1