Reaction Details
TargetPotassium voltage-gated channel subfamily H member 2
LigandBDBM50304807
Substrate/Competitorn/a
Meas. Tech.ChEMBL_606274 (CHEMBL1069964)
IC50 3900±n/a nM
Citation Liu, KKCornelius, PPatterson, TAZeng, YSantucci, STomlinson, EGibbons, CMaurer, TSMarala, RBrown, JKong, JXLee, EWerner, WWenzel, ZVage, C Design and synthesis of orally-active and selective azaindane 5HT2c agonist for the treatment of obesity. Bioorg Med Chem Lett20:266-71 (2010) 
 
Potassium voltage-gated channel subfamily H member 2
Name:Potassium voltage-gated channel subfamily H member 2
Type:Multi-pass membrane protein
Mol. Mass.:126672.65
Organism:Homo sapiens (Human)
Description:Q12809
Residue:1159
BDBM50304807
NameBDBM50304807
Synonyms:(S)-7-(5-fluoro-2-methylbenzyloxy)-2-((R)-2-methylpiperazin-1-yl)-6,7-dihydro-5H-cyclopenta[b]pyridine | CHEMBL594717
TypeSmall organic molecule
Emp. Form.C21H26FN3O
Mol. Mass.355.449
SMILESC[C@@H]1CNCCN1c1ccc2CC[C@H](OCc3cc(F)ccc3C)c2n1