Reaction Details
Target5-hydroxytryptamine receptor 2C
LigandBDBM50304810
Substrate/Competitorn/a
Meas. Tech.ChEMBL_606255 (CHEMBL1069945)
EC50 530±n/a nM
Citation Liu, KKCornelius, PPatterson, TAZeng, YSantucci, STomlinson, EGibbons, CMaurer, TSMarala, RBrown, JKong, JXLee, EWerner, WWenzel, ZVage, C Design and synthesis of orally-active and selective azaindane 5HT2c agonist for the treatment of obesity. Bioorg Med Chem Lett20:266-71 (2010) 
 
5-hydroxytryptamine receptor 2C
Name:5-hydroxytryptamine receptor 2C
Type:G Protein-Coupled Receptor (GPCR)
Mol. Mass.:51836.79
Organism:Homo sapiens (Human)
Description:P28335
Residue:458
BDBM50304810
NameBDBM50304810
Synonyms:4-(piperazin-1-yl)thieno[2,3-d]pyrimidine | CHEMBL596108
TypeSmall organic molecule
Emp. Form.C10H12N4S
Mol. Mass.220.294
SMILESC1CN(CCN1)c1ncnc2sccc12