Reaction Details
Target5-hydroxytryptamine receptor 2C
LigandBDBM50304800
Substrate/Competitorn/a
Meas. Tech.ChEMBL_606255 (CHEMBL1069945)
EC50 1.4±n/a nM
Citation Liu, KKCornelius, PPatterson, TAZeng, YSantucci, STomlinson, EGibbons, CMaurer, TSMarala, RBrown, JKong, JXLee, EWerner, WWenzel, ZVage, C Design and synthesis of orally-active and selective azaindane 5HT2c agonist for the treatment of obesity. Bioorg Med Chem Lett20:266-71 (2010) 
 
5-hydroxytryptamine receptor 2C
Name:5-hydroxytryptamine receptor 2C
Type:G Protein-Coupled Receptor (GPCR)
Mol. Mass.:51836.79
Organism:Homo sapiens (Human)
Description:P28335
Residue:458
BDBM50304800
NameBDBM50304800
Synonyms:(S)-7-(2,5-difluorobenzyloxy)-2-(piperazin-1-yl)-6,7-dihydro-5H-cyclopenta[b]pyridine | CHEMBL594469
TypeSmall organic molecule
Emp. Form.C19H21F2N3O
Mol. Mass.345.3863
SMILESFc1ccc(F)c(CO[C@H]2CCc3ccc(nc23)N2CCNCC2)c1