Reaction Details
Target5-hydroxytryptamine receptor 2C
LigandBDBM50304813
Substrate/Competitorn/a
Meas. Tech.ChEMBL_606257 (CHEMBL1069947)
Ki 207±n/a nM
Citation Liu, KKCornelius, PPatterson, TAZeng, YSantucci, STomlinson, EGibbons, CMaurer, TSMarala, RBrown, JKong, JXLee, EWerner, WWenzel, ZVage, C Design and synthesis of orally-active and selective azaindane 5HT2c agonist for the treatment of obesity. Bioorg Med Chem Lett20:266-71 (2010) 
 
5-hydroxytryptamine receptor 2C
Name:5-hydroxytryptamine receptor 2C
Type:G Protein-Coupled Receptor (GPCR)
Mol. Mass.:51836.79
Organism:Homo sapiens (Human)
Description:P28335
Residue:458
BDBM50304813
NameBDBM50304813
Synonyms:6-bromo-8-(piperazin-1-yl)imidazo[1,2-a]pyrazine | CHEMBL609595
TypeSmall organic molecule
Emp. Form.C10H12BrN5
Mol. Mass.282.14
SMILESBrc1cn2ccnc2c(n1)N1CCNCC1