Reaction Details
Target5-hydroxytryptamine receptor 2C
LigandBDBM50016970
Substrate/Competitorn/a
Meas. Tech.ChEMBL_606257 (CHEMBL1069947)
Ki 14±n/a nM
Citation Liu, KKCornelius, PPatterson, TAZeng, YSantucci, STomlinson, EGibbons, CMaurer, TSMarala, RBrown, JKong, JXLee, EWerner, WWenzel, ZVage, C Design and synthesis of orally-active and selective azaindane 5HT2c agonist for the treatment of obesity. Bioorg Med Chem Lett20:266-71 (2010) 
 
5-hydroxytryptamine receptor 2C
Name:5-hydroxytryptamine receptor 2C
Type:G Protein-Coupled Receptor (GPCR)
Mol. Mass.:51836.79
Organism:Homo sapiens (Human)
Description:P28335
Residue:458
BDBM50016970
NameBDBM50016970
Synonyms:4-Piperazin-1-yl-thieno[3,2-c]pyridine; hydrochloride CHEMBL608135
TypeSmall organic molecule
Emp. Form.C11H13N3S
Mol. Mass.219.306
SMILESC1CN(CCN1)c1nccc2sccc12