Reaction Details
Target5-hydroxytryptamine receptor 2C
LigandBDBM50304822
Substrate/Competitorn/a
Meas. Tech.ChEMBL_606256 (CHEMBL1069946)
IC50 410±n/a nM
Citation Liu, KKCornelius, PPatterson, TAZeng, YSantucci, STomlinson, EGibbons, CMaurer, TSMarala, RBrown, JKong, JXLee, EWerner, WWenzel, ZVage, C Design and synthesis of orally-active and selective azaindane 5HT2c agonist for the treatment of obesity. Bioorg Med Chem Lett20:266-71 (2010) 
 
5-hydroxytryptamine receptor 2C
Name:5-hydroxytryptamine receptor 2C
Type:G Protein-Coupled Receptor (GPCR)
Mol. Mass.:51836.79
Organism:Homo sapiens (Human)
Description:P28335
Residue:458
BDBM50304822
NameBDBM50304822
Synonyms:6-(3-chlorobenzyloxy)-2-(piperazin-1-yl)-9H-purine | CHEMBL611032
TypeSmall organic molecule
Emp. Form.C16H17ClN6O
Mol. Mass.344.799
SMILESClc1cccc(COc2nc(nc3nc[nH]c23)N2CCNCC2)c1