Reaction Details
Target5-hydroxytryptamine receptor 2A
LigandBDBM50304807
Substrate/Competitorn/a
Meas. Tech.ChEMBL_606264 (CHEMBL1069954)
Ki 4.4±n/a nM
Citation Liu, KKCornelius, PPatterson, TAZeng, YSantucci, STomlinson, EGibbons, CMaurer, TSMarala, RBrown, JKong, JXLee, EWerner, WWenzel, ZVage, C Design and synthesis of orally-active and selective azaindane 5HT2c agonist for the treatment of obesity. Bioorg Med Chem Lett20:266-71 (2010) 
 
5-hydroxytryptamine receptor 2A
Name:5-hydroxytryptamine receptor 2A
Type:G Protein-Coupled Receptor (GPCR)
Mol. Mass.:52852.05
Organism:Rattus norvegicus (rat)
Description:Rat cortex membranes 5-HT2A receptors.
Residue:471
BDBM50304807
NameBDBM50304807
Synonyms:(S)-7-(5-fluoro-2-methylbenzyloxy)-2-((R)-2-methylpiperazin-1-yl)-6,7-dihydro-5H-cyclopenta[b]pyridine | CHEMBL594717
TypeSmall organic molecule
Emp. Form.C21H26FN3O
Mol. Mass.355.449
SMILESC[C@@H]1CNCCN1c1ccc2CC[C@H](OCc3cc(F)ccc3C)c2n1