Reaction Details
Target5-hydroxytryptamine receptor 2A
LigandBDBM50304803
Substrate/Competitorn/a
Meas. Tech.ChEMBL_606264 (CHEMBL1069954)
Ki 2±n/a nM
Citation Liu, KKCornelius, PPatterson, TAZeng, YSantucci, STomlinson, EGibbons, CMaurer, TSMarala, RBrown, JKong, JXLee, EWerner, WWenzel, ZVage, C Design and synthesis of orally-active and selective azaindane 5HT2c agonist for the treatment of obesity. Bioorg Med Chem Lett20:266-71 (2010) 
 
5-hydroxytryptamine receptor 2A
Name:5-hydroxytryptamine receptor 2A
Type:G Protein-Coupled Receptor (GPCR)
Mol. Mass.:52852.05
Organism:Rattus norvegicus (rat)
Description:Rat cortex membranes 5-HT2A receptors.
Residue:471
BDBM50304803
NameBDBM50304803
Synonyms:(R)-8-(2-chlorophenoxy)-2-(piperazin-1-yl)-5,6,7,8-tetrahydroquinoline | CHEMBL593545
TypeSmall organic molecule
Emp. Form.C19H22ClN3O
Mol. Mass.343.85
SMILESClc1ccccc1O[C@@H]1CCCc2ccc(nc12)N1CCNCC1