Reaction Details
TargetTGF-beta receptor type-1
LigandBDBM50304838
Substrate/Competitorn/a
Meas. Tech.ChEMBL_606316 (CHEMBL1070008)
Ki>2800±n/a nM
Citation Guckian, KCarter, MBLin, EYChoi, MSun, LBoriack-Sjodin, PAChuaqui, CLane, BCheung, KLing, LLee, WC Pyrazolone based TGFbetaR1 kinase inhibitors. Bioorg Med Chem Lett20:326-9 (2010) 
 
TGF-beta receptor type-1
Name:TGF-beta receptor type-1
Type:enzyme
Mol. Mass.:55968.24
Organism:Homo sapiens (Human)
Description:P36897
Residue:503
BDBM50304838
NameBDBM50304838
Synonyms:1,2-dimethyl-4-(2-methylpyridin-4-yl)-5-(quinoxalin-6-yl)-1H-pyrazol-3(2H)-one | CHEMBL593012
TypeSmall organic molecule
Emp. Form.C19H17N5O
Mol. Mass.331.3712
SMILESCc1cc(ccn1)-c1c(-c2ccc3nccnc3c2)n(C)n(C)c1=O