Reaction Details
TargetTGF-beta receptor type-1
LigandBDBM50304849
Substrate/Competitorn/a
Meas. Tech.ChEMBL_606316 (CHEMBL1070008)
Ki 6±n/a nM
Citation Guckian, KCarter, MBLin, EYChoi, MSun, LBoriack-Sjodin, PAChuaqui, CLane, BCheung, KLing, LLee, WC Pyrazolone based TGFbetaR1 kinase inhibitors. Bioorg Med Chem Lett20:326-9 (2010) 
 
TGF-beta receptor type-1
Name:TGF-beta receptor type-1
Type:enzyme
Mol. Mass.:55968.24
Organism:Homo sapiens (Human)
Description:P36897
Residue:503
BDBM50304849
NameBDBM50304849
Synonyms:4-(3-ethylphenyl)-1,2-dimethyl-5-(quinoxalin-6-yl)-1H-pyrazol-3(2H)-one | CHEMBL594371
TypeSmall organic molecule
Emp. Form.C21H20N4O
Mol. Mass.344.4097
SMILESCCc1cccc(c1)-c1c(-c2ccc3nccnc3c2)n(C)n(C)c1=O