Reaction Details
TargetTGF-beta receptor type-1
LigandBDBM50304863
Substrate/Competitorn/a
Meas. Tech.ChEMBL_606317 (CHEMBL1070009)
IC50 1900±n/a nM
Citation Guckian, KCarter, MBLin, EYChoi, MSun, LBoriack-Sjodin, PAChuaqui, CLane, BCheung, KLing, LLee, WC Pyrazolone based TGFbetaR1 kinase inhibitors. Bioorg Med Chem Lett20:326-9 (2010) 
 
TGF-beta receptor type-1
Name:TGF-beta receptor type-1
Type:enzyme
Mol. Mass.:55968.24
Organism:Homo sapiens (Human)
Description:P36897
Residue:503
BDBM50304863
NameBDBM50304863
Synonyms:4-(3-chlorophenyl)-1,2-dimethyl-5-(quinoxalin-6-yl)-1H-pyrazol-3(2H)-one | CHEMBL592977
TypeSmall organic molecule
Emp. Form.C19H15ClN4O
Mol. Mass.350.802
SMILESCn1c(c(-c2cccc(Cl)c2)c(=O)n1C)-c1ccc2nccnc2c1