Reaction Details
TargetTGF-beta receptor type-1
LigandBDBM50304870
Substrate/Competitorn/a
Meas. Tech.ChEMBL_606317 (CHEMBL1070009)
IC50>10000±n/a nM
Citation Guckian, KCarter, MBLin, EYChoi, MSun, LBoriack-Sjodin, PAChuaqui, CLane, BCheung, KLing, LLee, WC Pyrazolone based TGFbetaR1 kinase inhibitors. Bioorg Med Chem Lett20:326-9 (2010) 
 
TGF-beta receptor type-1
Name:TGF-beta receptor type-1
Type:enzyme
Mol. Mass.:55968.24
Organism:Homo sapiens (Human)
Description:P36897
Residue:503
BDBM50304870
NameBDBM50304870
Synonyms:4-(furan-3-yl)-1,2-dimethyl-5-(quinoxalin-6-yl)-1H-pyrazol-3(2H)-one | CHEMBL609582
TypeSmall organic molecule
Emp. Form.C17H14N4O2
Mol. Mass.306.3187
SMILESCn1c(c(-c2ccoc2)c(=O)n1C)-c1ccc2nccnc2c1