Reaction Details
TargetCalmodulin-sensitive adenylate cyclase
LigandBDBM50304913
Substrate/Competitorn/a
Meas. Tech.ChEMBL_606615 (CHEMBL1071251)
Ki 100±n/a nM
Citation Emmrich, TEl-Tayeb, ATaha, HSeifert, RMüller, CELink, A Synthesis of a hydrolytically stable, fluorescent-labeled ATP analog as a tool for probing adenylyl cyclases. Bioorg Med Chem Lett20:232-5 (2010) 
 
Calmodulin-sensitive adenylate cyclase
Name:Calmodulin-sensitive adenylate cyclase
Type:PROTEIN
Mol. Mass.:92481.33
Organism:Bacillus anthracis
Description:ChEMBL_606615
Residue:800
BDBM50304913
NameBDBM50304913
Synonyms:(2R,3R,4R,5R)-2-(6-amino-2-oxopyrimidin-1(2H)-yl)-4-hydroxy-5-((hydroxy(hydroxy(phosphonooxy)phosphoryloxy)phosphoryloxy)methyl)tetrahydrofuran-3-yl 2-(methylamino)benzoate | CHEMBL594333
TypeSmall organic molecule
Emp. Form.C17H23N4O15P3
Mol. Mass.616.3036
SMILESCNc1ccccc1C(=O)O[C@@H]1[C@H](O)[C@@H](COP(O)(=O)OP(O)(=O)OP(O)(O)=O)O[C@H]1n1ccc(N)nc1=O