Reaction Details
TargetCannabinoid receptor 1
LigandBDBM50304925
Substrate/Competitorn/a
Meas. Tech.ChEMBL_606627 (CHEMBL1071854)
Ki 2100±n/a nM
Citation Sellitto, ILe Bourdonnec, BWorm, KGoodman, ASavolainen, MAChu, GHAjello, CWSaeui, CTLeister, LKCassel, JADehaven, RNLabuda, CJKoblish, MLittle, PJBrogdon, BLSmith, SADolle, RE Novel sulfamoyl benzamides as selective CB(2) agonists with improved in vitro metabolic stability. Bioorg Med Chem Lett20:387-91 (2010) 
 
Cannabinoid receptor 1
Name:Cannabinoid receptor 1
Type:G Protein-Coupled Receptor (GPCR)
Mol. Mass.:52868.96
Organism:Homo sapiens (Human)
Description:P21554
Residue:472
BDBM50304925
NameBDBM50304925
Synonyms:CHEMBL602128 | N-(3,4-dimethyl-5-(thiazolidin-3-ylsulfonyl)phenyl)-2,2-dimethylbutanamide
TypeSmall organic molecule
Emp. Form.C17H26N2O3S2
Mol. Mass.370.53
SMILESCCC(C)(C)C(=O)Nc1cc(C)c(C)c(c1)S(=O)(=O)N1CCSC1