Reaction Details
TargetCannabinoid receptor 2
LigandBDBM50304928
Substrate/Competitorn/a
Meas. Tech.ChEMBL_606628 (CHEMBL1071855)
Ki 2080±n/a nM
Citation Sellitto, ILe Bourdonnec, BWorm, KGoodman, ASavolainen, MAChu, GHAjello, CWSaeui, CTLeister, LKCassel, JADehaven, RNLabuda, CJKoblish, MLittle, PJBrogdon, BLSmith, SADolle, RE Novel sulfamoyl benzamides as selective CB(2) agonists with improved in vitro metabolic stability. Bioorg Med Chem Lett20:387-91 (2010) 
 
Cannabinoid receptor 2
Name:Cannabinoid receptor 2
Type:G Protein-Coupled Receptor (GPCR)
Mol. Mass.:39690.94
Organism:Homo sapiens (Human)
Description:P34972
Residue:360
BDBM50304928
NameBDBM50304928
Synonyms:CHEMBL593622 | N-(3,4-dimethyl-5-(morpholinosulfonyl)phenyl)-2-hydroxy-2-methylpropanamide
TypeSmall organic molecule
Emp. Form.C16H24N2O5S
Mol. Mass.356.437
SMILESCc1cc(NC(=O)C(C)(C)O)cc(c1C)S(=O)(=O)N1CCOCC1