Reaction Details
TargetCannabinoid receptor 2
LigandBDBM50304929
Substrate/Competitorn/a
Meas. Tech.ChEMBL_606628 (CHEMBL1071855)
Ki 110±n/a nM
Citation Sellitto, ILe Bourdonnec, BWorm, KGoodman, ASavolainen, MAChu, GHAjello, CWSaeui, CTLeister, LKCassel, JADehaven, RNLabuda, CJKoblish, MLittle, PJBrogdon, BLSmith, SADolle, RE Novel sulfamoyl benzamides as selective CB(2) agonists with improved in vitro metabolic stability. Bioorg Med Chem Lett20:387-91 (2010) 
 
Cannabinoid receptor 2
Name:Cannabinoid receptor 2
Type:G Protein-Coupled Receptor (GPCR)
Mol. Mass.:39690.94
Organism:Homo sapiens (Human)
Description:P34972
Residue:360
BDBM50304929
NameBDBM50304929
Synonyms:CHEMBL611937 | N-(3,4-dimethyl-5-(morpholinosulfonyl)phenyl)-4-methoxy-2,2-dimethylbutanamide
TypeSmall organic molecule
Emp. Form.C19H30N2O5S
Mol. Mass.398.517
SMILESCOCCC(C)(C)C(=O)Nc1cc(C)c(C)c(c1)S(=O)(=O)N1CCOCC1