Reaction Details
TargetCannabinoid receptor 2
LigandBDBM50304932
Substrate/Competitorn/a
Meas. Tech.ChEMBL_606628 (CHEMBL1071855)
Ki 410±n/a nM
Citation Sellitto, ILe Bourdonnec, BWorm, KGoodman, ASavolainen, MAChu, GHAjello, CWSaeui, CTLeister, LKCassel, JADehaven, RNLabuda, CJKoblish, MLittle, PJBrogdon, BLSmith, SADolle, RE Novel sulfamoyl benzamides as selective CB(2) agonists with improved in vitro metabolic stability. Bioorg Med Chem Lett20:387-91 (2010) 
 
Cannabinoid receptor 2
Name:Cannabinoid receptor 2
Type:G Protein-Coupled Receptor (GPCR)
Mol. Mass.:39690.94
Organism:Homo sapiens (Human)
Description:P34972
Residue:360
BDBM50304932
NameBDBM50304932
Synonyms:2,2-dimethyl-N-(2,3,4-trimethyl-5-(morpholinosulfonyl)phenyl)butanamide | CHEMBL584224
TypeSmall organic molecule
Emp. Form.C19H30N2O4S
Mol. Mass.382.518
SMILESCCC(C)(C)C(=O)Nc1cc(c(C)c(C)c1C)S(=O)(=O)N1CCOCC1