Reaction Details
TargetCannabinoid receptor 2
LigandBDBM50304934
Substrate/Competitorn/a
Meas. Tech.ChEMBL_606628 (CHEMBL1071855)
Ki 43±n/a nM
Citation Sellitto, ILe Bourdonnec, BWorm, KGoodman, ASavolainen, MAChu, GHAjello, CWSaeui, CTLeister, LKCassel, JADehaven, RNLabuda, CJKoblish, MLittle, PJBrogdon, BLSmith, SADolle, RE Novel sulfamoyl benzamides as selective CB(2) agonists with improved in vitro metabolic stability. Bioorg Med Chem Lett20:387-91 (2010) 
 
Cannabinoid receptor 2
Name:Cannabinoid receptor 2
Type:G Protein-Coupled Receptor (GPCR)
Mol. Mass.:39690.94
Organism:Homo sapiens (Human)
Description:P34972
Residue:360
BDBM50304934
NameBDBM50304934
Synonyms:(R)-N-(3-(2-(hydroxymethyl)pyrrolidin-1-ylsulfonyl)-4,5-dimethylphenyl)-2,2-dimethylbutanamide | CHEMBL591572
TypeSmall organic molecule
Emp. Form.C19H30N2O4S
Mol. Mass.382.518
SMILESCCC(C)(C)C(=O)Nc1cc(C)c(C)c(c1)S(=O)(=O)N1CCC[C@@H]1CO