Reaction Details
TargetCannabinoid receptor 2
LigandBDBM50304924
Substrate/Competitorn/a
Meas. Tech.ChEMBL_606628 (CHEMBL1071855)
Ki 9±n/a nM
Citation Sellitto, ILe Bourdonnec, BWorm, KGoodman, ASavolainen, MAChu, GHAjello, CWSaeui, CTLeister, LKCassel, JADehaven, RNLabuda, CJKoblish, MLittle, PJBrogdon, BLSmith, SADolle, RE Novel sulfamoyl benzamides as selective CB(2) agonists with improved in vitro metabolic stability. Bioorg Med Chem Lett20:387-91 (2010) 
 
Cannabinoid receptor 2
Name:Cannabinoid receptor 2
Type:G Protein-Coupled Receptor (GPCR)
Mol. Mass.:39690.94
Organism:Homo sapiens (Human)
Description:P34972
Residue:360
BDBM50304924
NameBDBM50304924
Synonyms:CHEMBL602591 | N-(3-(azepan-1-ylsulfonyl)-4,5-dimethylphenyl)-2,2-dimethylbutanamide
TypeSmall organic molecule
Emp. Form.C20H32N2O3S
Mol. Mass.380.545
SMILESCCC(C)(C)C(=O)Nc1cc(C)c(C)c(c1)S(=O)(=O)N1CCCCCC1