Reaction Details
TargetCannabinoid receptor 2
LigandBDBM50304918
Substrate/Competitorn/a
Meas. Tech.ChEMBL_606629 (CHEMBL1071856)
EC50 21±n/a nM
Citation Sellitto, ILe Bourdonnec, BWorm, KGoodman, ASavolainen, MAChu, GHAjello, CWSaeui, CTLeister, LKCassel, JADehaven, RNLabuda, CJKoblish, MLittle, PJBrogdon, BLSmith, SADolle, RE Novel sulfamoyl benzamides as selective CB(2) agonists with improved in vitro metabolic stability. Bioorg Med Chem Lett20:387-91 (2010) 
 
Cannabinoid receptor 2
Name:Cannabinoid receptor 2
Type:Enzyme
Mol. Mass.:39366.68
Organism:Rattus norvegicus (Rat)
Description:Q9QZN9
Residue:360
BDBM50304918
NameBDBM50304918
Synonyms:CHEMBL595035 | N-(3,4-dimethyl-5-(morpholinosulfonyl)phenyl)-2,2-dimethylpentanamide
TypeSmall organic molecule
Emp. Form.C19H30N2O4S
Mol. Mass.382.518
SMILESCCCC(C)(C)C(=O)Nc1cc(C)c(C)c(c1)S(=O)(=O)N1CCOCC1