Reaction Details
TargetCannabinoid receptor 2
LigandBDBM50304922
Substrate/Competitorn/a
Meas. Tech.ChEMBL_606629 (CHEMBL1071856)
EC50 98±n/a nM
Citation Sellitto, ILe Bourdonnec, BWorm, KGoodman, ASavolainen, MAChu, GHAjello, CWSaeui, CTLeister, LKCassel, JADehaven, RNLabuda, CJKoblish, MLittle, PJBrogdon, BLSmith, SADolle, RE Novel sulfamoyl benzamides as selective CB(2) agonists with improved in vitro metabolic stability. Bioorg Med Chem Lett20:387-91 (2010) 
 
Cannabinoid receptor 2
Name:Cannabinoid receptor 2
Type:Enzyme
Mol. Mass.:39366.68
Organism:Rattus norvegicus (Rat)
Description:Q9QZN9
Residue:360
BDBM50304922
NameBDBM50304922
Synonyms:CHEMBL592264 | N-(3-(N-cyclopentylsulfamoyl)-4,5-dimethylphenyl)-2,2-dimethylbutanamide
TypeSmall organic molecule
Emp. Form.C19H30N2O3S
Mol. Mass.366.518
SMILESCCC(C)(C)C(=O)Nc1cc(C)c(C)c(c1)S(=O)(=O)NC1CCCC1