Reaction Details
TargetCannabinoid receptor 2
LigandBDBM50304925
Substrate/Competitorn/a
Meas. Tech.ChEMBL_606629 (CHEMBL1071856)
EC50 12±n/a nM
Citation Sellitto, ILe Bourdonnec, BWorm, KGoodman, ASavolainen, MAChu, GHAjello, CWSaeui, CTLeister, LKCassel, JADehaven, RNLabuda, CJKoblish, MLittle, PJBrogdon, BLSmith, SADolle, RE Novel sulfamoyl benzamides as selective CB(2) agonists with improved in vitro metabolic stability. Bioorg Med Chem Lett20:387-91 (2010) 
 
Cannabinoid receptor 2
Name:Cannabinoid receptor 2
Type:Enzyme
Mol. Mass.:39366.68
Organism:Rattus norvegicus (Rat)
Description:Q9QZN9
Residue:360
BDBM50304925
NameBDBM50304925
Synonyms:CHEMBL602128 | N-(3,4-dimethyl-5-(thiazolidin-3-ylsulfonyl)phenyl)-2,2-dimethylbutanamide
TypeSmall organic molecule
Emp. Form.C17H26N2O3S2
Mol. Mass.370.53
SMILESCCC(C)(C)C(=O)Nc1cc(C)c(C)c(c1)S(=O)(=O)N1CCSC1