Reaction Details
TargetProgesterone receptor
LigandBDBM50298028
Substrate/Competitorn/a
Meas. Tech.ChEMBL_606887 (CHEMBL1071273)
IC50 16±n/a nM
Citation Kallander, LSWashburn, DGHoang, THFrazee, JSStoy, PJohnson, LLu, QHammond, MBarton, LSPatterson, JRAzzarano, LMNagilla, RMadauss, KPWilliams, SPStewart, ELDuraiswami, CGrygielko, ETXu, XLaping, NJBray, JDThompson, SK Improving the developability profile of pyrrolidine progesterone receptor partial agonists. Bioorg Med Chem Lett20:371-4 (2010) 
 
Progesterone receptor
Name:Progesterone receptor
Type:Protein
Mol. Mass.:98979.52
Organism:Homo sapiens (Human)
Description:P06401
Residue:933
BDBM50298028
NameBDBM50298028
Synonyms:(S)-2-chloro-4-((1-methylpyrrolidin-3-yl)(2-(trifluoromethyl)benzyl)amino)benzonitrile CHEMBL558664
TypeSmall organic molecule
Emp. Form.C20H19ClF3N3
Mol. Mass.393.833
SMILESCN1CC[C@@H](C1)N(Cc1ccccc1C(F)(F)F)c1ccc(C#N)c(Cl)c1