Reaction Details
TargetProgesterone receptor
LigandBDBM50304976
Substrate/Competitorn/a
Meas. Tech.ChEMBL_606887 (CHEMBL1071273)
IC50 12±n/a nM
Citation Kallander, LSWashburn, DGHoang, THFrazee, JSStoy, PJohnson, LLu, QHammond, MBarton, LSPatterson, JRAzzarano, LMNagilla, RMadauss, KPWilliams, SPStewart, ELDuraiswami, CGrygielko, ETXu, XLaping, NJBray, JDThompson, SK Improving the developability profile of pyrrolidine progesterone receptor partial agonists. Bioorg Med Chem Lett20:371-4 (2010) 
 
Progesterone receptor
Name:Progesterone receptor
Type:Protein
Mol. Mass.:98979.52
Organism:Homo sapiens (Human)
Description:P06401
Residue:933
BDBM50304976
NameBDBM50304976
Synonyms:(S)-methyl 3-((3-chloro-4-cyanophenyl)(2-fluorobenzyl)amino)pyrrolidine-1-carboxylate | CHEMBL592289
TypeSmall organic molecule
Emp. Form.C20H19ClFN3O2
Mol. Mass.387.835
SMILESCOC(=O)N1CC[C@@H](C1)N(Cc1ccccc1F)c1ccc(C#N)c(Cl)c1