Reaction Details
TargetProgesterone receptor
LigandBDBM50304979
Substrate/Competitorn/a
Meas. Tech.ChEMBL_606887 (CHEMBL1071273)
IC50 20±n/a nM
Citation Kallander, LSWashburn, DGHoang, THFrazee, JSStoy, PJohnson, LLu, QHammond, MBarton, LSPatterson, JRAzzarano, LMNagilla, RMadauss, KPWilliams, SPStewart, ELDuraiswami, CGrygielko, ETXu, XLaping, NJBray, JDThompson, SK Improving the developability profile of pyrrolidine progesterone receptor partial agonists. Bioorg Med Chem Lett20:371-4 (2010) 
 
Progesterone receptor
Name:Progesterone receptor
Type:Protein
Mol. Mass.:98979.52
Organism:Homo sapiens (Human)
Description:P06401
Residue:933
BDBM50304979
NameBDBM50304979
Synonyms:(S)-methyl 3-((3-chloro-4-cyanophenyl)(2,3-difluorobenzyl)amino)pyrrolidine-1-carboxylate | CHEMBL592745
TypeSmall organic molecule
Emp. Form.C20H18ClF2N3O2
Mol. Mass.405.826
SMILESCOC(=O)N1CC[C@@H](C1)N(Cc1cccc(F)c1F)c1ccc(C#N)c(Cl)c1