Reaction Details
TargetMAP kinase-activated protein kinase 2
LigandBDBM50305013
Substrate/Competitorn/a
Meas. Tech.ChEMBL_606910 (CHEMBL1072653)
IC50 20±n/a nM
Citation Harris, CMEricsson, AMArgiriadi, MABarberis, CBorhani, DWBurchat, ACalderwood, DJCunha, GADixon, RWFrank, KEJohnson, EFKamens, JKwak, SLi, BMullen, KDPerron, DCWang, LWishart, NWu, XZhang, XZmetra, TRTalanian, RV 2,4-Diaminopyrimidine MK2 inhibitors. Part II: Structure-based inhibitor optimization. Bioorg Med Chem Lett20:334-7 (2010) 
 
MAP kinase-activated protein kinase 2
Name:MAP kinase-activated protein kinase 2
Type:Serine/threonine-protein kinase
Mol. Mass.:45579.87
Organism:Homo sapiens (Human)
Description:P49137
Residue:400
BDBM50305013
NameBDBM50305013
Synonyms:3-(2-amino-7-(7-(benzo[b]thiophen-2-yl)-1H-indazol-5-yl)-5H-pyrrolo[3,2-d]pyrimidin-5-yl)propanoic acid | CHEMBL594090
TypeSmall organic molecule
Emp. Form.C24H18N6O2S
Mol. Mass.454.504
SMILESNc1ncc2n(CCC(O)=O)cc(-c3cc(-c4cc5ccccc5s4)c4[nH]ncc4c3)c2n1