Reaction Details
TargetMAP kinase-activated protein kinase 2
LigandBDBM50305014
Substrate/Competitorn/a
Meas. Tech.ChEMBL_606910 (CHEMBL1072653)
IC50 41±n/a nM
Citation Harris, CMEricsson, AMArgiriadi, MABarberis, CBorhani, DWBurchat, ACalderwood, DJCunha, GADixon, RWFrank, KEJohnson, EFKamens, JKwak, SLi, BMullen, KDPerron, DCWang, LWishart, NWu, XZhang, XZmetra, TRTalanian, RV 2,4-Diaminopyrimidine MK2 inhibitors. Part II: Structure-based inhibitor optimization. Bioorg Med Chem Lett20:334-7 (2010) 
 
MAP kinase-activated protein kinase 2
Name:MAP kinase-activated protein kinase 2
Type:Serine/threonine-protein kinase
Mol. Mass.:45579.87
Organism:Homo sapiens (Human)
Description:P49137
Residue:400
BDBM50305014
NameBDBM50305014
Synonyms:3-(2-amino-7-(7-(benzo[b]thiophen-2-yl)-1H-indazol-5-yl)-5H-pyrrolo[3,2-d]pyrimidin-5-yl)propanamide | CHEMBL603322
TypeSmall organic molecule
Emp. Form.C24H19N7OS
Mol. Mass.453.519
SMILESNC(=O)CCn1cc(-c2cc(-c3cc4ccccc4s3)c3[nH]ncc3c2)c2nc(N)ncc12