Reaction Details
TargetTyrosine-protein kinase ABL1
LigandBDBM50305006
Substrate/Competitorn/a
Meas. Tech.ChEMBL_606962 (CHEMBL1073289)
IC50>10000±n/a nM
Citation Harris, CMEricsson, AMArgiriadi, MABarberis, CBorhani, DWBurchat, ACalderwood, DJCunha, GADixon, RWFrank, KEJohnson, EFKamens, JKwak, SLi, BMullen, KDPerron, DCWang, LWishart, NWu, XZhang, XZmetra, TRTalanian, RV 2,4-Diaminopyrimidine MK2 inhibitors. Part II: Structure-based inhibitor optimization. Bioorg Med Chem Lett20:334-7 (2010) 
 
Tyrosine-protein kinase ABL1
Name:Tyrosine-protein kinase ABL1
Type:Enzyme
Mol. Mass.:122897.30
Organism:Homo sapiens (Human)
Description:P00519
Residue:1130
BDBM50305006
NameBDBM50305006
Synonyms:5-(2-aminoethyl)-7-(7-(benzo[b]thiophen-2-yl)-1H-indazol-5-yl)-5H-pyrrolo[3,2-d]pyrimidin-2-amine | CHEMBL590109
TypeSmall organic molecule
Emp. Form.C23H19N7S
Mol. Mass.425.509
SMILESNCCn1cc(-c2cc(-c3cc4ccccc4s3)c3[nH]ncc3c2)c2nc(N)ncc12