Reaction Details
TargetMetabotropic glutamate receptor 5
LigandBDBM50305047
Substrate/Competitorn/a
Meas. Tech.ChEMBL_602838 (CHEMBL1065282)
IC50 140±n/a nM
Citation Spanka, CGlatthar, RDesrayaud, SFendt, MOrain, DTroxler, TVranesic, I Piperidyl amides as novel, potent and orally active mGlu5 receptor antagonists with anxiolytic-like activity. Bioorg Med Chem Lett20:184-8 (2010) 
 
Metabotropic glutamate receptor 5
Name:Metabotropic glutamate receptor 5
Type:Enzyme
Mol. Mass.:132484.72
Organism:Homo sapiens (Human)
Description:n/a
Residue:1212
BDBM50305047
NameBDBM50305047
Synonyms:CHEMBL593848 | rac-(5-chloro-6-(6-methylpyridin-3-ylamino)pyridin-3-yl)(3-propylpiperidin-1-yl)methanone
TypeSmall organic molecule
Emp. Form.C20H25ClN4O
Mol. Mass.372.892
SMILESCCCC1CCCN(C1)C(=O)c1cnc(Nc2ccc(C)nc2)c(Cl)c1