Reaction Details
TargetMetabotropic glutamate receptor 5
LigandBDBM50305055
Substrate/Competitorn/a
Meas. Tech.ChEMBL_602838 (CHEMBL1065282)
IC50 360±n/a nM
Citation Spanka, CGlatthar, RDesrayaud, SFendt, MOrain, DTroxler, TVranesic, I Piperidyl amides as novel, potent and orally active mGlu5 receptor antagonists with anxiolytic-like activity. Bioorg Med Chem Lett20:184-8 (2010) 
 
Metabotropic glutamate receptor 5
Name:Metabotropic glutamate receptor 5
Type:Enzyme
Mol. Mass.:132484.72
Organism:Homo sapiens (Human)
Description:n/a
Residue:1212
BDBM50305055
NameBDBM50305055
Synonyms:(S)-(5-chloro-6-(6-methylpyridin-3-ylamino)pyridin-3-yl)(2-ethylpiperidin-1-yl)methanone | CHEMBL594091
TypeSmall organic molecule
Emp. Form.C19H23ClN4O
Mol. Mass.358.865
SMILESCC[C@H]1CCCCN1C(=O)c1cnc(Nc2ccc(C)nc2)c(Cl)c1