Reaction Details
TargetMetabotropic glutamate receptor 5
LigandBDBM50305017
Substrate/Competitorn/a
Meas. Tech.ChEMBL_602837 (CHEMBL1065281)
IC50 310±n/a nM
Citation Spanka, CGlatthar, RDesrayaud, SFendt, MOrain, DTroxler, TVranesic, I Piperidyl amides as novel, potent and orally active mGlu5 receptor antagonists with anxiolytic-like activity. Bioorg Med Chem Lett20:184-8 (2010) 
 
Metabotropic glutamate receptor 5
Name:Metabotropic glutamate receptor 5
Type:Enzyme
Mol. Mass.:132484.72
Organism:Homo sapiens (Human)
Description:n/a
Residue:1212
BDBM50305017
NameBDBM50305017
Synonyms:(6-(4-chlorophenylamino)pyridin-3-yl)(piperidin-1-yl)methanone | CHEMBL595943
TypeSmall organic molecule
Emp. Form.C17H18ClN3O
Mol. Mass.315.797
SMILESClc1ccc(Nc2ccc(cn2)C(=O)N2CCCCC2)cc1