Reaction Details
TargetMetabotropic glutamate receptor 5
LigandBDBM50305056
Substrate/Competitorn/a
Meas. Tech.ChEMBL_603017 (CHEMBL1045620)
Ki 30±n/a nM
Citation Spanka, CGlatthar, RDesrayaud, SFendt, MOrain, DTroxler, TVranesic, I Piperidyl amides as novel, potent and orally active mGlu5 receptor antagonists with anxiolytic-like activity. Bioorg Med Chem Lett20:184-8 (2010) 
 
Metabotropic glutamate receptor 5
Name:Metabotropic glutamate receptor 5
Type:Enzyme
Mol. Mass.:131900.14
Organism:Rattus norvegicus (Rat)
Description:P31424
Residue:1203
BDBM50305056
NameBDBM50305056
Synonyms:(R)-(5-chloro-6-(6-methylpyridin-3-ylamino)pyridin-3-yl)(2-ethylpiperidin-1-yl)methanone | CHEMBL593590
TypeSmall organic molecule
Emp. Form.C19H23ClN4O
Mol. Mass.358.865
SMILESCC[C@@H]1CCCCN1C(=O)c1cnc(Nc2ccc(C)nc2)c(Cl)c1