Reaction Details
TargetOxysterols receptor LXR-beta
LigandBDBM50305064
Substrate/Competitorn/a
Meas. Tech.ChEMBL_603037 (CHEMBL1047698)
IC50 4.7±n/a nM
Citation Bernotas, RCSinghaus, RRKaufman, DHTravins, JMUllrich, JWUnwalla, RQuinet, EEvans, MNambi, POlland, AKauppi, BWilhelmsson, AGoos-Nilsson, AWrobel, J 4-(3-Aryloxyaryl)quinoline sulfones are potent liver X receptor agonists. Bioorg Med Chem Lett20:209-12 (2010) 
 
Oxysterols receptor LXR-beta
Name:Oxysterols receptor LXR-beta
Type:Enzyme Catalytic Domain
Mol. Mass.:50978.79
Organism:Homo sapiens (Human)
Description:P55055
Residue:460
BDBM50305064
NameBDBM50305064
Synonyms:3-(3-(3-(3-methyl-8-(trifluoromethyl)quinolin-4-yl)phenoxy)phenylsulfonyl)propan-1-ol | CHEMBL593472
TypeSmall organic molecule
Emp. Form.C26H22F3NO4S
Mol. Mass.501.517
SMILESCc1cnc2c(cccc2c1-c1cccc(Oc2cccc(c2)S(=O)(=O)CCCO)c1)C(F)(F)F