Reaction Details
TargetMu-type opioid receptor
LigandBDBM50305085
Substrate/Competitorn/a
Meas. Tech.ChEMBL_603077 (CHEMBL1048560)
Ki>10000±n/a nM
Citation Li, WTao, YMTang, YXu, XJChen, JFu, WWang, XHChao, BSheng, WXie, QQiu, ZBLiu, JG Highly selective and potent mu opioid ligands by unexpected substituent on morphine skeleton. Bioorg Med Chem Lett20:418-21 (2010) 
 
Mu-type opioid receptor
Name:Mu-type opioid receptor
Type:G Protein-Coupled Receptor (GPCR)
Mol. Mass.:44503.11
Organism:Rattus norvegicus (rat)
Description:Competition binding assays were carried out using membrane preparations from transfected HN9.10 cells that constitutively expressed the mu opioid receptor.
Residue:398
BDBM50305085
NameBDBM50305085
Synonyms:8alpha-phenyl-6alpha,14alpha-endo-Ethenotetrahydrothebaine | CHEMBL594124
TypeSmall organic molecule
Emp. Form.C27H29NO3
Mol. Mass.415.5241
SMILESCOc1ccc2C[C@H]3N(C)CC[C@@]45[C@@H](Oc1c24)[C@]1(C[C@@H](c2ccccc2)[C@]35C=C1)OC