Reaction Details
TargetSodium-dependent serotonin transporter
LigandBDBM50305106
Substrate/Competitorn/a
Meas. Tech.ChEMBL_603082 (CHEMBL1048565)
Ki 6.00±n/a nM
Citation Shen, ZSiva Ramamoorthy, PHatzenbuhler, NTEvrard, DAChilders, WHarrison, BLChlenov, MHornby, GSmith, DLSullivan, KMSchechter, LEAndree, TH Synthesis and structure-activity relationship of novel lactam-fused chroman derivatives having dual affinity at the 5-HT(1A) receptor and the serotonin transporter. Bioorg Med Chem Lett20:222-7 (2010) 
 
Sodium-dependent serotonin transporter
Name:Sodium-dependent serotonin transporter
Type:Multi-pass membrane protein
Mol. Mass.:70322.51
Organism:Homo sapiens (Human)
Description:P31645
Residue:630
BDBM50305106
NameBDBM50305106
Synonyms:(+)-8-((cyclopropylmethyl)(3-(5-fluoro-1H-indol-3-yl)propyl)amino)-2,3,8,9-tetrahydropyrano[3,2-e]isoindol-1(7H)-one CHEMBL607419 | Rac-8-((cyclopropylmethyl)(3-(5-fluoro-1H-indol-3-yl)propyl)amino)-2,3,8,9-tetrahydropyrano[3,2-e]isoindol-1(7H)-one
TypeSmall organic molecule
Emp. Form.C26H28FN3O2
Mol. Mass.433.5178
SMILESFc1ccc2[nH]cc(CCCN(CC3CC3)C3COc4ccc5CNC(=O)c5c4C3)c2c1