Reaction Details
TargetProtein kinase C alpha type
LigandBDBM50305126
Substrate/Competitorn/a
Meas. Tech.ChEMBL_603260 (CHEMBL1049484)
IC50>10000±n/a nM
Citation Takayama, TUmemiya, HAmada, HYabuuchi, TKoami, TShiozawa, FOka, YTakaoka, AYamaguchi, AEndo, MSato, M Ring-fused pyrazole derivatives as potent inhibitors of lymphocyte-specific kinase (Lck): Structure, synthesis, and SAR. Bioorg Med Chem Lett20:112-6 (2010) 
 
Protein kinase C alpha type
Name:Protein kinase C alpha type
Type:Enzyme
Mol. Mass.:76755.65
Organism:Homo sapiens (Human)
Description:The recombinant human PKC enzymes were produced using a baculovirus expression system in SF9 cells
Residue:672
BDBM50305126
NameBDBM50305126
Synonyms:7-(2-(dimethylamino)ethoxy)-2-(4-phenoxyphenyl)-9,10-dihydro-4H-benzo[d]pyrazolo[1,5-a][1,3]diazepine-3-carboxamide | CHEMBL591325
TypeSmall organic molecule
Emp. Form.C28H29N5O3
Mol. Mass.483.5616
SMILESCN(C)CCOc1ccc2Nc3c(C(N)=O)c(nn3CCc2c1)-c1ccc(Oc2ccccc2)cc1