Reaction Details
TargetTyrosine-protein kinase Lck
LigandBDBM50305133
Substrate/Competitorn/a
Meas. Tech.ChEMBL_603253 (CHEMBL1049477)
IC50>100±n/a nM
Citation Takayama, TUmemiya, HAmada, HYabuuchi, TKoami, TShiozawa, FOka, YTakaoka, AYamaguchi, AEndo, MSato, M Ring-fused pyrazole derivatives as potent inhibitors of lymphocyte-specific kinase (Lck): Structure, synthesis, and SAR. Bioorg Med Chem Lett20:112-6 (2010) 
 
Tyrosine-protein kinase Lck
Name:Tyrosine-protein kinase Lck
Type:n/a
Mol. Mass.:57987.83
Organism:Homo sapiens (Human)
Description:P06239
Residue:509
BDBM50305133
NameBDBM50305133
Synonyms:6-(4-methylpentyloxy)-2-(4-phenoxyphenyl)-9,10-dihydro-4H-benzo[d]pyrazolo[1,5-a][1,3]diazepine-3-carboxamide | CHEMBL592505
TypeSmall organic molecule
Emp. Form.C30H32N4O3
Mol. Mass.496.6001
SMILESCC(C)CCCOc1ccc2CCn3nc(c(C(N)=O)c3Nc2c1)-c1ccc(Oc2ccccc2)cc1